Reaction Details
TargetALK tyrosine kinase receptor
LigandBDBM50344662
Substrate/Competitorn/a
Meas. Tech.ChEMBL_748985 (CHEMBL1781770)
IC50 1.8±n/a nM
Citation Kinoshita, KOno, YEmura, TAsoh, KFuruichi, NIto, TKawada, HTanaka, SMorikami, KTsukaguchi, TSakamoto, HTsukuda, TOikawa, N Discovery of novel tetracyclic compounds as anaplastic lymphoma kinase inhibitors. Bioorg Med Chem Lett21:3788-93 (2011) 
 
ALK tyrosine kinase receptor
Name:ALK tyrosine kinase receptor
Type:Protein
Mol. Mass.:176453.10
Organism:Homo sapiens (Human)
Description:Q9UM73
Residue:1620
BDBM50344662
NameBDBM50344662
Synonyms:8-(4-isopropylpiperazin-1-yl)-6,6-dimethyl-11-oxo-6,11-dihydro-5H-benzo[b]carbazole-3-carbonitrile US9126931, 90
TypeSmall organic molecule
Emp. Form.C26H28N4O
Mol. Mass.412.5267
SMILESCC(C)N1CCN(CC1)c1ccc2C(=O)c3c([nH]c4cc(ccc34)C#N)C(C)(C)c2c1