Reaction Details
TargetMast/stem cell growth factor receptor Kit
LigandBDBM50344664
Substrate/Competitorn/a
Meas. Tech.ChEMBL_748992 (CHEMBL1781777)
IC50>50000±n/a nM
Citation Kinoshita, KOno, YEmura, TAsoh, KFuruichi, NIto, TKawada, HTanaka, SMorikami, KTsukaguchi, TSakamoto, HTsukuda, TOikawa, N Discovery of novel tetracyclic compounds as anaplastic lymphoma kinase inhibitors. Bioorg Med Chem Lett21:3788-93 (2011) 
 
Mast/stem cell growth factor receptor Kit
Name:Mast/stem cell growth factor receptor Kit
Type:Protein
Mol. Mass.:109869.37
Organism:Homo sapiens (Human)
Description:P10721
Residue:976
BDBM50344664
NameBDBM50344664
Synonyms:6,6-dimethyl-8-(1-(oxetan-3-yl)piperidin-4-yl)-11-oxo-6,11-dihydro-5H-benzo[b]carbazole-3-carbonitrile US9126931, 178
TypeSmall organic molecule
Emp. Form.C27H27N3O2
Mol. Mass.425.5222
SMILESCC1(C)c2[nH]c3cc(ccc3c2C(=O)c2ccc(cc12)C1CCN(CC1)C1COC1)C#N