Reaction Details
TargetATP-dependent translocase ABCB1
LigandBDBM50293015
Substrate/Competitorn/a
Meas. Tech.ChEMBL_749178 (CHEMBL1780906)
IC50>29000±n/a nM
Citation Puentes, COHöcherl, PKühnle, MBauer, SBürger, KBernhardt, GBuschauer, AKönig, B Solid phase synthesis of tariquidar-related modulators of ABC transporters preferring breast cancer resistance protein (ABCG2). Bioorg Med Chem Lett21:3654-7 (2011) 
 
ATP-dependent translocase ABCB1
Name:ATP-dependent translocase ABCB1
Type:Protein
Mol. Mass.:141503.50
Organism:Homo sapiens (Human)
Description:P08183
Residue:1280
BDBM50293015
NameBDBM50293015
Synonyms:CHEMBL502503 | Methyl 4-((4-(2-(6,7-Dimethoxy-1,2,3,4-tetrahydroisoquinolin-2-yl)ethyl)phenyl)amino-carbonyl)-2-(quinoline-2-carbonylamino)benzoate
TypeSmall organic molecule
Emp. Form.C38H36N4O6
Mol. Mass.644.7156
SMILESCOC(=O)c1ccc(cc1NC(=O)c1ccc2ccccc2n1)C(=O)Nc1ccc(CCN2CCc3cc(OC)c(OC)cc3C2)cc1