Reaction Details
TargetATP-dependent translocase ABCB1
LigandBDBM50344757
Substrate/Competitorn/a
Meas. Tech.ChEMBL_749178 (CHEMBL1780906)
IC50>100000±n/a nM
Citation Puentes, COHöcherl, PKühnle, MBauer, SBürger, KBernhardt, GBuschauer, AKönig, B Solid phase synthesis of tariquidar-related modulators of ABC transporters preferring breast cancer resistance protein (ABCG2). Bioorg Med Chem Lett21:3654-7 (2011) 
 
ATP-dependent translocase ABCB1
Name:ATP-dependent translocase ABCB1
Type:Protein
Mol. Mass.:141503.50
Organism:Homo sapiens (Human)
Description:P08183
Residue:1280
BDBM50344757
NameBDBM50344757
Synonyms:CHEMBL1779522 | N-{4-[2-(6-Methoxy-7-{2-[2-(2-methoxy-ethoxy)-ethoxy]-ethoxy}-3,4-dihydro-1H-isoquinolin-2-yl)-ethyl]-phenyl}-2-[(quinoline-2-carbonyl)-amino]-terephthalamic acid trifluoroacetic acid
TypeSmall organic molecule
Emp. Form.C43H46N4O9
Mol. Mass.762.8467
SMILESCOCCOCCOCCOc1cc2CN(CCc3ccc(NC(=O)c4ccc(C(O)=O)c(NC(=O)c5ccc6ccccc6n5)c4)cc3)CCc2cc1OC