Reaction Details
TargetBroad substrate specificity ATP-binding cassette transporter ABCG2
LigandBDBM50344752
Substrate/Competitorn/a
Meas. Tech.ChEMBL_749177 (CHEMBL1780905)
IC50 508±n/a nM
Citation Puentes, COHöcherl, PKühnle, MBauer, SBürger, KBernhardt, GBuschauer, AKönig, B Solid phase synthesis of tariquidar-related modulators of ABC transporters preferring breast cancer resistance protein (ABCG2). Bioorg Med Chem Lett21:3654-7 (2011) 
 
Broad substrate specificity ATP-binding cassette transporter ABCG2
Name:Broad substrate specificity ATP-binding cassette transporter ABCG2
Type:Multi-pass membrane protein; monomer or homodimer; disulfide-linked
Mol. Mass.:72329.48
Organism:Homo sapiens (Human)
Description:Q9UNQ0
Residue:655
BDBM50344752
NameBDBM50344752
Synonyms:CHEMBL1777831 | methyl 4-(4-(2-(6-methoxy-7-(2-(2-(2-methoxyethoxy)ethoxy)ethoxy)-3,4-dihydroisoquinolin-2(1H)-yl)ethyl)phenylcarbamoyl)-2-(quinoline-6-carboxamido)benzoate
TypeSmall organic molecule
Emp. Form.C44H48N4O9
Mol. Mass.776.8733
SMILESCOCCOCCOCCOc1cc2CN(CCc3ccc(NC(=O)c4ccc(C(=O)OC)c(NC(=O)c5ccc6ncccc6c5)c4)cc3)CCc2cc1OC