Reaction Details
TargetDipeptidyl peptidase 4
LigandBDBM50344769
Substrate/Competitorn/a
Meas. Tech.ChEMBL_749181 (CHEMBL1780909)
IC50 13.7±n/a nM
Citation Kim, HJKwak, WYMin, JPLee, JYYoon, THKim, HDShin, CYKim, MKChoi, SHKim, HSYang, EKCheong, YHChae, YNPark, KJJang, JMChoi, SJSon, MHKim, SHYoo, MLee, BJ Discovery of DA-1229: a potent, long acting dipeptidyl peptidase-4 inhibitor for the treatment of type 2 diabetes. Bioorg Med Chem Lett21:3809-12 (2011) 
 
Dipeptidyl peptidase 4
Name:Dipeptidyl peptidase 4
Type:Enzyme
Mol. Mass.:88271.01
Organism:Homo sapiens (Human)
Description:P27487
Residue:766
BDBM50344769
NameBDBM50344769
Synonyms:(R)-4-(3-amino-4-(2,4,5-trifluorophenyl)butanoyl)-1-(2-nitrobenzyl)piperazin-2-one | CHEMBL1779695
TypeSmall organic molecule
Emp. Form.C21H21F3N4O4
Mol. Mass.450.411
SMILESN[C@@H](CC(=O)N1CCN(Cc2ccccc2[N+]([O-])=O)C(=O)C1)Cc1cc(F)c(F)cc1F