Reaction Details
TargetSphingosine 1-phosphate receptor 4
LigandBDBM50344797
Substrate/Competitorn/a
Meas. Tech.ChEMBL_749238 (CHEMBL1781181)
IC50 21±n/a nM
Citation Guerrero, MUrbano, MVelaparthi, SZhao, JSchaeffer, MTBrown, SRosen, HRoberts, E Discovery, design and synthesis of the first reported potent and selective sphingosine-1-phosphate 4 (S1P4) receptor antagonists. Bioorg Med Chem Lett21:3632-6 (2011) 
 
Sphingosine 1-phosphate receptor 4
Name:Sphingosine 1-phosphate receptor 4
Type:G Protein-Coupled Receptor (GPCR)
Mol. Mass.:41647.39
Organism:Homo sapiens (Human)
Description:n/a
Residue:384
BDBM50344797
NameBDBM50344797
Synonyms:5-(2,5-dichlorophenyl)-N-(4-(hydroxymethyl)-2,6-dimethylphenyl)furan-2-carboxamide | CHEMBL1779890
TypeSmall organic molecule
Emp. Form.C20H17Cl2NO3
Mol. Mass.390.26
SMILESCc1cc(CO)cc(C)c1NC(=O)c1ccc(o1)-c1cc(Cl)ccc1Cl