Reaction Details
TargetSphingosine 1-phosphate receptor 4
LigandBDBM62394
Substrate/Competitorn/a
Meas. Tech.ChEMBL_749238 (CHEMBL1781181)
IC50 308±n/a nM
Citation Guerrero, MUrbano, MVelaparthi, SZhao, JSchaeffer, MTBrown, SRosen, HRoberts, E Discovery, design and synthesis of the first reported potent and selective sphingosine-1-phosphate 4 (S1P4) receptor antagonists. Bioorg Med Chem Lett21:3632-6 (2011) 
 
Sphingosine 1-phosphate receptor 4
Name:Sphingosine 1-phosphate receptor 4
Type:G Protein-Coupled Receptor (GPCR)
Mol. Mass.:41647.39
Organism:Homo sapiens (Human)
Description:n/a
Residue:384
BDBM62394
NameBDBM62394
Synonyms:5-(2,5-difluorophenyl)-N-(2,6-dimethylphenyl)-2-furamide 5-(2,5-difluorophenyl)-N-(2,6-dimethylphenyl)furan-2-carboxamide SR-02000000238 cid_44607573
TypeSmall organic molecule
Emp. Form.C19H15F2NO2
Mol. Mass.327.3247
SMILESCc1cccc(C)c1NC(=O)c1ccc(o1)-c1cc(F)ccc1F