Reaction Details
TargetSphingosine 1-phosphate receptor 4
LigandBDBM50344806
Substrate/Competitorn/a
Meas. Tech.ChEMBL_749238 (CHEMBL1781181)
IC50 513±n/a nM
Citation Guerrero, MUrbano, MVelaparthi, SZhao, JSchaeffer, MTBrown, SRosen, HRoberts, E Discovery, design and synthesis of the first reported potent and selective sphingosine-1-phosphate 4 (S1P4) receptor antagonists. Bioorg Med Chem Lett21:3632-6 (2011) 
 
Sphingosine 1-phosphate receptor 4
Name:Sphingosine 1-phosphate receptor 4
Type:G Protein-Coupled Receptor (GPCR)
Mol. Mass.:41647.39
Organism:Homo sapiens (Human)
Description:n/a
Residue:384
BDBM50344806
NameBDBM50344806
Synonyms:5-(2,5-dimethoxyphenyl)-N-(2,6-dimethylphenyl)-N-methylfuran-2-carboxamide | CHEMBL1779910
TypeSmall organic molecule
Emp. Form.C22H23NO4
Mol. Mass.365.4223
SMILESCOc1ccc(OC)c(c1)-c1ccc(o1)C(=O)N(C)c1c(C)cccc1C