Reaction Details
TargetSphingosine 1-phosphate receptor 4
LigandBDBM50344809
Substrate/Competitorn/a
Meas. Tech.ChEMBL_749238 (CHEMBL1781181)
IC50 118±n/a nM
Citation Guerrero, MUrbano, MVelaparthi, SZhao, JSchaeffer, MTBrown, SRosen, HRoberts, E Discovery, design and synthesis of the first reported potent and selective sphingosine-1-phosphate 4 (S1P4) receptor antagonists. Bioorg Med Chem Lett21:3632-6 (2011) 
 
Sphingosine 1-phosphate receptor 4
Name:Sphingosine 1-phosphate receptor 4
Type:G Protein-Coupled Receptor (GPCR)
Mol. Mass.:41647.39
Organism:Homo sapiens (Human)
Description:n/a
Residue:384
BDBM50344809
NameBDBM50344809
Synonyms:CHEMBL1779914 | N-(2,6-dimethylphenyl)-5-(thiophen-2-yl)furan-2-carboxamide
TypeSmall organic molecule
Emp. Form.C17H15NO2S
Mol. Mass.297.371
SMILESCc1cccc(C)c1NC(=O)c1ccc(o1)-c1cccs1