Reaction Details
TargetSphingosine 1-phosphate receptor 4
LigandBDBM62398
Substrate/Competitorn/a
Meas. Tech.ChEMBL_749238 (CHEMBL1781181)
IC50 165±n/a nM
Citation Guerrero, MUrbano, MVelaparthi, SZhao, JSchaeffer, MTBrown, SRosen, HRoberts, E Discovery, design and synthesis of the first reported potent and selective sphingosine-1-phosphate 4 (S1P4) receptor antagonists. Bioorg Med Chem Lett21:3632-6 (2011) 
 
Sphingosine 1-phosphate receptor 4
Name:Sphingosine 1-phosphate receptor 4
Type:G Protein-Coupled Receptor (GPCR)
Mol. Mass.:41647.39
Organism:Homo sapiens (Human)
Description:n/a
Residue:384
BDBM62398
NameBDBM62398
Synonyms:5-(2,5-dichlorophenyl)-N-(2,5-dimethylphenyl)-2-furamide 5-(2,5-dichlorophenyl)-N-(2,5-dimethylphenyl)furan-2-carboxamide SR-02000000242 cid_1114196
TypeSmall organic molecule
Emp. Form.C19H15Cl2NO2
Mol. Mass.360.234
SMILESCc1ccc(C)c(NC(=O)c2ccc(o2)-c2cc(Cl)ccc2Cl)c1