Reaction Details
TargetSphingosine 1-phosphate receptor 4
LigandBDBM62400
Substrate/Competitorn/a
Meas. Tech.ChEMBL_749238 (CHEMBL1781181)
IC50 417±n/a nM
Citation Guerrero, MUrbano, MVelaparthi, SZhao, JSchaeffer, MTBrown, SRosen, HRoberts, E Discovery, design and synthesis of the first reported potent and selective sphingosine-1-phosphate 4 (S1P4) receptor antagonists. Bioorg Med Chem Lett21:3632-6 (2011) 
 
Sphingosine 1-phosphate receptor 4
Name:Sphingosine 1-phosphate receptor 4
Type:G Protein-Coupled Receptor (GPCR)
Mol. Mass.:41647.39
Organism:Homo sapiens (Human)
Description:n/a
Residue:384
BDBM62400
NameBDBM62400
Synonyms:5-(2,5-dichlorophenyl)-N-(2,6-dimethoxyphenyl)-2-furamide 5-(2,5-dichlorophenyl)-N-(2,6-dimethoxyphenyl)furan-2-carboxamide SR-02000000244 cid_44607576
TypeSmall organic molecule
Emp. Form.C19H15Cl2NO4
Mol. Mass.392.233
SMILESCOc1cccc(OC)c1NC(=O)c1ccc(o1)-c1cc(Cl)ccc1Cl