Reaction Details
TargetSphingosine 1-phosphate receptor 2
LigandBDBM50344792
Substrate/Competitorn/a
Meas. Tech.ChEMBL_749242 (CHEMBL1781185)
IC50 2800±n/a nM
Citation Guerrero, MUrbano, MVelaparthi, SZhao, JSchaeffer, MTBrown, SRosen, HRoberts, E Discovery, design and synthesis of the first reported potent and selective sphingosine-1-phosphate 4 (S1P4) receptor antagonists. Bioorg Med Chem Lett21:3632-6 (2011) 
 
Sphingosine 1-phosphate receptor 2
Name:Sphingosine 1-phosphate receptor 2
Type:G Protein-Coupled Receptor (GPCR)
Mol. Mass.:38883.16
Organism:Homo sapiens (Human)
Description:Membranes isolated from S1P2-transfected CHO cells were used in ligand binding assay.
Residue:353
BDBM50344792
NameBDBM50344792
Synonyms:5-(2,5-dichlorophenyl)-N-(4-hydroxy-2,6-dimethylphenyl)furan-2-carboxamide | CHEMBL1779895
TypeSmall organic molecule
Emp. Form.C19H15Cl2NO3
Mol. Mass.376.233
SMILESCc1cc(O)cc(C)c1NC(=O)c1ccc(o1)-c1cc(Cl)ccc1Cl