Reaction Details
TargetSodium channel protein type 9 subunit alpha
LigandBDBM50344834
Substrate/Competitorn/a
Meas. Tech.ChEMBL_749248 (CHEMBL1781191)
IC50 20±n/a nM
Citation Chowdhury, SChafeev, MLiu, SSun, JRaina, VChui, RYoung, WKwan, RFu, JCadieux, JA Discovery of XEN907, a spirooxindole blocker of NaV1.7 for the treatment of pain. Bioorg Med Chem Lett21:3676-81 (2011) 
 
Sodium channel protein type 9 subunit alpha
Name:Sodium channel protein type 9 subunit alpha
Type:Protein
Mol. Mass.:226375.97
Organism:Homo sapiens (Human)
Description:Q15858
Residue:1988
BDBM50344834
NameBDBM50344834
Synonyms:3-(benzo[d][1,3]dioxol-5-yl)-1-(2-cyclopropylethyl)-3-hydroxyindolin-2-one | CHEMBL1779935
TypeSmall organic molecule
Emp. Form.C20H19NO4
Mol. Mass.337.3692
SMILESOC1(C(=O)N(CCC2CC2)c2ccccc12)c1ccc2OCOc2c1