Reaction Details
TargetP2X purinoceptor 7
LigandBDBM50344907
Substrate/Competitorn/a
Meas. Tech.ChEMBL_748931 (CHEMBL1781379)
IC50 42±n/a nM
Citation Matasi, JJBrumfield, STulshian, DCzarnecki, MGreenlee, WGarlisi, CGQiu, HDevito, KChen, SCSun, YBertorelli, RGeiss, WLe, VDMartin, GSVellekoop, SAHaber, JAllard, ML Synthesis and SAR development of novel P2X7 receptor antagonists for the treatment of pain: part 1. Bioorg Med Chem Lett21:3805-8 (2011) 
 
P2X purinoceptor 7
Name:P2X purinoceptor 7
Type:Protein
Mol. Mass.:68602.85
Organism:Homo sapiens (Human)
Description:Q99572
Residue:595
BDBM50344907
NameBDBM50344907
Synonyms:(R)-1-(3,4-difluorobenzyl)-5-ethyl-7-isopropyl-2-(6-(piperidine-1-carbonyl)pyridin-3-yl)-7,8-dihydro-1H-imidazo[2,1-b]purin-4(5H)-one | CHEMBL1778028
TypeSmall organic molecule
Emp. Form.C30H33F2N7O2
Mol. Mass.561.6255
SMILESCCN1C2=N[C@@H](CN2c2c(nc(-c3ccc(nc3)C(=O)N3CCCCC3)n2Cc2ccc(F)c(F)c2)C1=O)C(C)C