Reaction Details
TargetP2X purinoceptor 7
LigandBDBM50344936
Substrate/Competitorn/a
Meas. Tech.ChEMBL_748931 (CHEMBL1781379)
IC50 35±n/a nM
Citation Matasi, JJBrumfield, STulshian, DCzarnecki, MGreenlee, WGarlisi, CGQiu, HDevito, KChen, SCSun, YBertorelli, RGeiss, WLe, VDMartin, GSVellekoop, SAHaber, JAllard, ML Synthesis and SAR development of novel P2X7 receptor antagonists for the treatment of pain: part 1. Bioorg Med Chem Lett21:3805-8 (2011) 
 
P2X purinoceptor 7
Name:P2X purinoceptor 7
Type:Protein
Mol. Mass.:68602.85
Organism:Homo sapiens (Human)
Description:Q99572
Residue:595
BDBM50344936
NameBDBM50344936
Synonyms:(R)-1-(2,4-difluorobenzyl)-5-ethyl-2-(4-fluorophenyl)-7-isopropyl-7,8-dihydro-1H-imidazo[2,1-b]purin-4(5H)-one | CHEMBL1777926
TypeSmall organic molecule
Emp. Form.C25H24F3N5O
Mol. Mass.467.4862
SMILESCCN1C2=N[C@@H](CN2c2c(nc(-c3ccc(F)cc3)n2Cc2ccc(F)cc2F)C1=O)C(C)C