Reaction Details
TargetP2X purinoceptor 7
LigandBDBM50344913
Substrate/Competitorn/a
Meas. Tech.ChEMBL_748931 (CHEMBL1781379)
IC50 41±n/a nM
Citation Matasi, JJBrumfield, STulshian, DCzarnecki, MGreenlee, WGarlisi, CGQiu, HDevito, KChen, SCSun, YBertorelli, RGeiss, WLe, VDMartin, GSVellekoop, SAHaber, JAllard, ML Synthesis and SAR development of novel P2X7 receptor antagonists for the treatment of pain: part 1. Bioorg Med Chem Lett21:3805-8 (2011) 
 
P2X purinoceptor 7
Name:P2X purinoceptor 7
Type:Protein
Mol. Mass.:68602.85
Organism:Homo sapiens (Human)
Description:Q99572
Residue:595
BDBM50344913
NameBDBM50344913
Synonyms:(R)-5-(1-(3,4-difluorobenzyl)-5-ethyl-7-isopropyl-4-oxo-4,5,7,8-tetrahydro-1H-imidazo[2,1-b]purin-2-yl)picolinonitrile | CHEMBL1777948
TypeSmall organic molecule
Emp. Form.C25H23F2N7O
Mol. Mass.475.4932
SMILESCCN1C2=N[C@@H](CN2c2c(nc(-c3ccc(nc3)C#N)n2Cc2ccc(F)c(F)c2)C1=O)C(C)C