Reaction Details
TargetSqualene synthase
LigandBDBM50118898
Substrate/Competitorn/a
Meas. Tech.ChEMBL_749032 (CHEMBL1781817)
IC50 260±n/a nM
Citation Griebenow, NBuchmueller, AKolkhof, PSchamberger, JBischoff, H Identification of 4H,6H-[2]benzoxepino[4,5-c][1,2]oxazoles as novel squalene synthase inhibitors. Bioorg Med Chem Lett21:3648-53 (2011) 
 
Squalene synthase
Name:Squalene synthase
Type:PROTEIN
Mol. Mass.:48114.76
Organism:Homo sapiens (Human)
Description:ChEMBL_1352847
Residue:417
BDBM50118898
NameBDBM50118898
Synonyms:(1-{2-[7-Chloro-5-(2,3-dimethoxy-phenyl)-1-(3-hydroxy-2,2-dimethyl-propyl)-2-oxo-1,2,3,5-tetrahydro-benzo[e][1,4]oxazepin-3-yl]-acetyl}-piperidin-4-yl)-acetic acid | CHEMBL341976
TypeSmall organic molecule
Emp. Form.C31H39ClN2O8
Mol. Mass.603.103
SMILESCOc1cccc([C@H]2O[C@H](CC(=O)N3CCC(CC(O)=O)CC3)C(=O)N(CC(C)(C)CO)c3ccc(Cl)cc23)c1OC