Reaction Details
TargetProtein kinase C alpha type
LigandBDBM50345026
Substrate/Competitorn/a
Meas. Tech.ChEMBL_749161 (CHEMBL1780758)
Ki 2340±n/a nM
Citation Hirai, GOhkubo, MTamura, YSodeoka, M Design and synthesis of protein kinase Ca activators based on 'out of pocket' interactions. Bioorg Med Chem Lett21:3587-90 (2011) 
 
Protein kinase C alpha type
Name:Protein kinase C alpha type
Type:Enzyme
Mol. Mass.:76755.65
Organism:Homo sapiens (Human)
Description:The recombinant human PKC enzymes were produced using a baculovirus expression system in SF9 cells
Residue:672
BDBM50345026
NameBDBM50345026
Synonyms:(1R,2R,4S,5S)-3-(3-((R)-1-((2-tert-butyl-3,3-dimethylbutanoyloxy)methyl)-1-(hydroxymethyl)-3-oxo-1,3-dihydroisobenzofuran-4-yl)prop-2-ynyloxy)-6-(dodecyloxy)cyclohexane-1,2,4,5-tetrayl tetraacetate | CHEMBL1778821
TypeSmall organic molecule
Emp. Form.C49H72O15
Mol. Mass.901.087
SMILESCCCCCCCCCCCCO[C@@H]1[C@H](OC(C)=O)[C@@H](OC(C)=O)[C@H](OCC#Cc2cccc3c2C(=O)O[C@]3(CO)COC(=O)C(C(C)(C)C)C(C)(C)C)[C@@H](OC(C)=O)[C@@H]1OC(C)=O