Reaction Details
TargetVasopressin V1b receptor
LigandBDBM50345072
Substrate/Competitorn/a
Meas. Tech.ChEMBL_748689 (CHEMBL1780542)
Ki 2500±n/a nM
Citation Baker, JBingham, MBlackburn-Munro, RCai, JCraighead, MGilfillan, RGoan, KJaap, DMilne, RMorphy, JRNapier, SPresland, JSpinks, GThomson, F Identification and optimisation of novel sulfonamide, selective vasopressin V1B receptor antagonists. Bioorg Med Chem Lett21:3603-7 (2011) 
 
Vasopressin V1b receptor
Name:Vasopressin V1b receptor
Type:Enzyme
Mol. Mass.:46985.01
Organism:Homo sapiens (Human)
Description:P47901
Residue:424
BDBM50345072
NameBDBM50345072
Synonyms:(S)-2-(4-methoxy-2,3,6-trimethylphenylsulfonamido)-N-(3-(4-methylpiperidin-1-yl)propyl)-3-phenylpropanamide | CHEMBL1779225
TypeSmall organic molecule
Emp. Form.C28H41N3O4S
Mol. Mass.515.708
SMILESCOc1cc(C)c(c(C)c1C)S(=O)(=O)N[C@@H](Cc1ccccc1)C(=O)NCCCN1CCC(C)CC1