Reaction Details
TargetVasopressin V1b receptor
LigandBDBM50345081
Substrate/Competitorn/a
Meas. Tech.ChEMBL_748689 (CHEMBL1780542)
Ki 310±n/a nM
Citation Baker, JBingham, MBlackburn-Munro, RCai, JCraighead, MGilfillan, RGoan, KJaap, DMilne, RMorphy, JRNapier, SPresland, JSpinks, GThomson, F Identification and optimisation of novel sulfonamide, selective vasopressin V1B receptor antagonists. Bioorg Med Chem Lett21:3603-7 (2011) 
 
Vasopressin V1b receptor
Name:Vasopressin V1b receptor
Type:Enzyme
Mol. Mass.:46985.01
Organism:Homo sapiens (Human)
Description:P47901
Residue:424
BDBM50345081
NameBDBM50345081
Synonyms:(1,4-diazepan-1-yl)(5-fluoro-1-(4-methoxy-2,3-dimethylphenylsulfonyl)-2-methyl-1H-indol-3-yl)methanone | CHEMBL1779233
TypeSmall organic molecule
Emp. Form.C24H28FN3O4S
Mol. Mass.473.56
SMILESCOc1ccc(c(C)c1C)S(=O)(=O)n1c(C)c(C(=O)N2CCCNCC2)c2cc(F)ccc12