Reaction Details
TargetVasopressin V1a receptor
LigandBDBM50345130
Substrate/Competitorn/a
Meas. Tech.ChEMBL_748739 (CHEMBL1780592)
Ki 101±n/a nM
Citation Oost, TBackfisch, GBhowmik, Svan Gaalen, MMGeneste, HHornberger, WLubisch, WNetz, AUnger, LWernet, W Potent and selective oxindole-based vasopressin 1b receptor antagonists with improved pharmacokinetic properties. Bioorg Med Chem Lett21:3828-31 (2011) 
 
Vasopressin V1a receptor
Name:Vasopressin V1a receptor
Type:Receptor
Mol. Mass.:46820.18
Organism:Homo sapiens (Human)
Description:P37288
Residue:418
BDBM50345130
NameBDBM50345130
Synonyms:(S)-1-((R)-5-chloro-3-(2-methoxy-4-(pyrrolidin-1-ylmethyl)phenyl)-1-(4-methoxyphenylsulfonyl)-2-oxoindolin-3-yl)-N,N-dimethylpyrrolidine-2-carboxamide | CHEMBL1779406
TypeSmall organic molecule
Emp. Form.C34H39ClN4O6S
Mol. Mass.667.215
SMILESCOc1ccc(cc1)S(=O)(=O)N1C(=O)[C@@](N2CCC[C@H]2C(=O)N(C)C)(c2cc(Cl)ccc12)c1ccc(CN2CCCC2)cc1OC