Reaction Details
TargetHeat shock protein HSP 90-alpha
LigandBDBM20732
Substrate/Competitorn/a
Meas. Tech.ChEMBL_748762 (CHEMBL1780615)
IC50 40±n/a nM
Citation Zapf, CWBloom, JDMcBean, JLDushin, RGGolas, JMLiu, HLucas, JBoschelli, FVogan, ELevin, JI Discovery of a macrocyclic o-aminobenzamide Hsp90 inhibitor with heterocyclic tether that shows extended biomarker activity and in vivo efficacy in a mouse xenograft model. Bioorg Med Chem Lett21:3627-31 (2011) 
 
Heat shock protein HSP 90-alpha
Name:Heat shock protein HSP 90-alpha
Type:Molecular Chaperone
Mol. Mass.:84623.45
Organism:Homo sapiens (Human)
Description:P07900
Residue:732
BDBM20732
NameBDBM20732
Synonyms:(4E,6Z,8S,9S,10E,12S,13R,14S,16R)-13-hydroxy-8,14,19-trimethoxy-4,10,12,16-tetramethyl-3,20,22-trioxo-2-azabicyclo[16.3.1]docosa-1(21),4,6,10,18-pentaen-9-yl carbamate CHEMBL278315 Geldanamycin | geldanomycin
Typen/a
Emp. Form.C29H40N2O9
Mol. Mass.560.6359
SMILESCO[C@H]1CC(C)=Cc2c(O)c(NC(=O)C(C)=CC=C[C@H](OC)[C@@H](OC(N)=O)\C(C)=C\[C@H](C)[C@H]1O)cc(O)c2OC