Reaction Details
TargetHeat shock protein HSP 90-alpha
LigandBDBM50345150
Substrate/Competitorn/a
Meas. Tech.ChEMBL_748762 (CHEMBL1780615)
IC50 96±n/a nM
Citation Zapf, CWBloom, JDMcBean, JLDushin, RGGolas, JMLiu, HLucas, JBoschelli, FVogan, ELevin, JI Discovery of a macrocyclic o-aminobenzamide Hsp90 inhibitor with heterocyclic tether that shows extended biomarker activity and in vivo efficacy in a mouse xenograft model. Bioorg Med Chem Lett21:3627-31 (2011) 
 
Heat shock protein HSP 90-alpha
Name:Heat shock protein HSP 90-alpha
Type:Molecular Chaperone
Mol. Mass.:84623.45
Organism:Homo sapiens (Human)
Description:P07900
Residue:732
BDBM50345150
NameBDBM50345150
Synonyms:(3aR)-13,13,16-trimethyl-15-oxo-1,2,3,3a,4,5,12,14,15,17,18,19-dodecahydro-13H-10,6-(metheno)pyrrolo[2',1':3,4][1,4,9]triazacyclotetradecino[9,8-a]indole-7-carboxamide | CHEMBL1738705
TypeSmall organic molecule
Emp. Form.C26H34N4O2
Mol. Mass.434.5738
SMILESCc1c2CCCN3CCC[C@@H]3CNc3cc(ccc3C(N)=O)-n2c2CC(C)(C)CC(=O)c12