Reaction Details
TargetHeat shock protein HSP 90-alpha
LigandBDBM50345154
Substrate/Competitorn/a
Meas. Tech.ChEMBL_748762 (CHEMBL1780615)
IC50 3324±n/a nM
Citation Zapf, CWBloom, JDMcBean, JLDushin, RGGolas, JMLiu, HLucas, JBoschelli, FVogan, ELevin, JI Discovery of a macrocyclic o-aminobenzamide Hsp90 inhibitor with heterocyclic tether that shows extended biomarker activity and in vivo efficacy in a mouse xenograft model. Bioorg Med Chem Lett21:3627-31 (2011) 
 
Heat shock protein HSP 90-alpha
Name:Heat shock protein HSP 90-alpha
Type:Molecular Chaperone
Mol. Mass.:84623.45
Organism:Homo sapiens (Human)
Description:P07900
Residue:732
BDBM50345154
NameBDBM50345154
Synonyms:CHEMBL1779534
TypeSmall organic molecule
Emp. Form.C26H35N5O2
Mol. Mass.449.5884
SMILESCc1c2CCCN3CCNC[C@H]3CNc3cc(ccc3C(N)=O)-n2c2CC(C)(C)CC(=O)c12