Reaction Details
TargetPotassium voltage-gated channel subfamily H member 2
LigandBDBM50345155
Substrate/Competitorn/a
Meas. Tech.ChEMBL_748773 (CHEMBL1780626)
IC50 24400±n/a nM
Citation Zapf, CWBloom, JDMcBean, JLDushin, RGGolas, JMLiu, HLucas, JBoschelli, FVogan, ELevin, JI Discovery of a macrocyclic o-aminobenzamide Hsp90 inhibitor with heterocyclic tether that shows extended biomarker activity and in vivo efficacy in a mouse xenograft model. Bioorg Med Chem Lett21:3627-31 (2011) 
 
Potassium voltage-gated channel subfamily H member 2
Name:Potassium voltage-gated channel subfamily H member 2
Type:Multi-pass membrane protein
Mol. Mass.:126672.65
Organism:Homo sapiens (Human)
Description:Q12809
Residue:1159
BDBM50345155
NameBDBM50345155
Synonyms:CHEMBL1779535
TypeSmall organic molecule
Emp. Form.C28H37N5O3
Mol. Mass.491.6251
SMILESCC(=O)N1CCN2CCCc3c(C)c4c(CC(C)(C)CC4=O)n3-c3ccc(C(N)=O)c(NC[C@H]2C1)c3