Reaction Details
TargetPotassium voltage-gated channel subfamily H member 2
LigandBDBM50345165
Substrate/Competitorn/a
Meas. Tech.ChEMBL_748773 (CHEMBL1780626)
IC50 1500±n/a nM
Citation Zapf, CWBloom, JDMcBean, JLDushin, RGGolas, JMLiu, HLucas, JBoschelli, FVogan, ELevin, JI Discovery of a macrocyclic o-aminobenzamide Hsp90 inhibitor with heterocyclic tether that shows extended biomarker activity and in vivo efficacy in a mouse xenograft model. Bioorg Med Chem Lett21:3627-31 (2011) 
 
Potassium voltage-gated channel subfamily H member 2
Name:Potassium voltage-gated channel subfamily H member 2
Type:Multi-pass membrane protein
Mol. Mass.:126672.65
Organism:Homo sapiens (Human)
Description:Q12809
Residue:1159
BDBM50345165
NameBDBM50345165
Synonyms:CHEMBL1779545
TypeSmall organic molecule
Emp. Form.C28H38N4O2
Mol. Mass.462.6269
SMILESC[C@@H]1Nc2cc(ccc2C(N)=O)-n2c3CC(C)(C)CC(=O)c3c(C)c2CCCN2CCCC[C@H]12