Reaction Details
TargetRenin
LigandBDBM50345193
Substrate/Competitorn/a
Meas. Tech.ChEMBL_751249 (CHEMBL1787617)
IC50 0.9±n/a nM
Citation Thangapandian, SJohn, SSakkiah, SLee, KW Potential virtual lead identification in the discovery of renin inhibitors: application of ligand and structure-based pharmacophore modeling approaches. Eur J Med Chem46:2469-76 (2011) 
 
Renin
Name:Renin
Type:Enzyme
Mol. Mass.:45058.99
Organism:Homo sapiens (Human)
Description:n/a
Residue:406
BDBM50345193
NameBDBM50345193
Synonyms:CHEMBL1783186 | N-(4-amino-8-(butylamino)-5-hydroxy-2-isopropyl-7-methyl-8-oxooctyl)-3-(3-methoxypropoxy)benzamide
TypeSmall organic molecule
Emp. Form.C27H47N3O5
Mol. Mass.493.6792
SMILESCCCCNC(=O)C(C)CC(O)C(N)CC(CNC(=O)c1cccc(OCCCOC)c1)C(C)C