Reaction Details
TargetP2Y purinoceptor 12
LigandBDBM50345302
Substrate/Competitorn/a
Meas. Tech.ChEMBL_752183 (CHEMBL1786559)
IC50 210±n/a nM
Citation Bach, PBoström, JBrickmann, Kvan Giezen, JJHovland, RPetersson, AURay, AZetterberg, F A novel series of piperazinyl-pyridine ureas as antagonists of the purinergic P2Y12 receptor. Bioorg Med Chem Lett21:2877-81 (2011) 
 
P2Y purinoceptor 12
Name:P2Y purinoceptor 12
Type:Enzyme
Mol. Mass.:39458.48
Organism:Homo sapiens (Human)
Description:Q9H244
Residue:342
BDBM50345302
NameBDBM50345302
Synonyms:CHEMBL1784189 | Ethyl 6-(4-{[(3-chlorophenyl)amino]carbonyl}piperazin-1-yl)-5-cyano-2-(trifluoro-methyl)nicotinate
TypeSmall organic molecule
Emp. Form.C21H19ClF3N5O3
Mol. Mass.481.855
SMILESCCOC(=O)c1cc(C#N)c(nc1C(F)(F)F)N1CCN(CC1)C(=O)Nc1cccc(Cl)c1