Reaction Details
TargetP2Y purinoceptor 12
LigandBDBM50345312
Substrate/Competitorn/a
Meas. Tech.ChEMBL_752183 (CHEMBL1786559)
IC50 83±n/a nM
Citation Bach, PBoström, JBrickmann, Kvan Giezen, JJHovland, RPetersson, AURay, AZetterberg, F A novel series of piperazinyl-pyridine ureas as antagonists of the purinergic P2Y12 receptor. Bioorg Med Chem Lett21:2877-81 (2011) 
 
P2Y purinoceptor 12
Name:P2Y purinoceptor 12
Type:Enzyme
Mol. Mass.:39458.48
Organism:Homo sapiens (Human)
Description:Q9H244
Residue:342
BDBM50345312
NameBDBM50345312
Synonyms:CHEMBL1784198 | Ethyl 5-cyano-6-{4-[(2-naphthylamino)carbonyl]piperazin-1-yl}-2-(trifluoromethyl)-nicotinate
TypeSmall organic molecule
Emp. Form.C25H22F3N5O3
Mol. Mass.497.4691
SMILESCCOC(=O)c1cc(C#N)c(nc1C(F)(F)F)N1CCN(CC1)C(=O)Nc1ccc2ccccc2c1