Reaction Details
TargetP2Y purinoceptor 12
LigandBDBM50345318
Substrate/Competitorn/a
Meas. Tech.ChEMBL_752182 (CHEMBL1786558)
IC50 170±n/a nM
Citation Bach, PBoström, JBrickmann, Kvan Giezen, JJHovland, RPetersson, AURay, AZetterberg, F A novel series of piperazinyl-pyridine ureas as antagonists of the purinergic P2Y12 receptor. Bioorg Med Chem Lett21:2877-81 (2011) 
 
P2Y purinoceptor 12
Name:P2Y purinoceptor 12
Type:Enzyme
Mol. Mass.:39458.48
Organism:Homo sapiens (Human)
Description:Q9H244
Residue:342
BDBM50345318
NameBDBM50345318
Synonyms:CHEMBL1784204 | Ethyl 5-chloro-6-(4-{[(3-chlorophenyl)amino]carbonyl}piperazin-1-yl)nicotinate
TypeSmall organic molecule
Emp. Form.C19H20Cl2N4O3
Mol. Mass.423.293
SMILESCCOC(=O)c1cnc(N2CCN(CC2)C(=O)Nc2cccc(Cl)c2)c(Cl)c1