Reaction Details
TargetDihydroorotate dehydrogenase (quinone), mitochondrial
LigandBDBM50345414
Substrate/Competitorn/a
Meas. Tech.ChEMBL_751786 (CHEMBL1785541)
IC50 130±n/a nM
Citation Gujjar, REl Mazouni, FWhite, KLWhite, JCreason, SShackleford, DMDeng, XCharman, WNBathurst, IBurrows, JFloyd, DMMatthews, DBuckner, FSCharman, SAPhillips, MARathod, PK Lead optimization of aryl and aralkyl amine-based triazolopyrimidine inhibitors of Plasmodium falciparum dihydroorotate dehydrogenase with antimalarial activity in mice. J Med Chem54:3935-49 (2011) 
 
Dihydroorotate dehydrogenase (quinone), mitochondrial
Name:Dihydroorotate dehydrogenase (quinone), mitochondrial
Type:Enzyme
Mol. Mass.:65581.88
Organism:Plasmodium falciparum
Description:His6-tag DHODH was expressed in E. coli.
Residue:569
BDBM50345414
NameBDBM50345414
Synonyms:CHEMBL1784567 US9238653, Table 5, Compound 48
TypeSmall organic molecule
Emp. Form.C12H10F5N5S
Mol. Mass.351.298
SMILESCc1cc(Nc2ccc(cc2)S(F)(F)(F)(F)F)n2ncnc2n1