Reaction Details
TargetMast/stem cell growth factor receptor Kit
LigandBDBM50345444
Substrate/Competitorn/a
Meas. Tech.ChEMBL_751994 (CHEMBL1786065)
IC50>10000±n/a nM
Citation Chen, ZWang, XZhu, WCao, XTong, LLi, HXie, HXu, YTan, SKuang, DDing, JQian, X Acenaphtho[1,2-b]pyrrole-based selective fibroblast growth factor receptors 1 (FGFR1) inhibitors: design, synthesis, and biological activity. J Med Chem54:3732-45 (2011) 
 
Mast/stem cell growth factor receptor Kit
Name:Mast/stem cell growth factor receptor Kit
Type:Protein
Mol. Mass.:109869.37
Organism:Homo sapiens (Human)
Description:P10721
Residue:976
BDBM50345444
NameBDBM50345444
Synonyms:CHEMBL1784725 | Ethyl 8-oxo-8H-acenaphtho[1,2-b]pyrrole-9-carboxylate
TypeSmall organic molecule
Emp. Form.C17H11NO3
Mol. Mass.277.2741
SMILESCCOC(=O)c1c2c3cccc4cccc(c2nc1=O)c34