Reaction Details
TargetFibroblast growth factor receptor 1
LigandBDBM50345451
Substrate/Competitorn/a
Meas. Tech.ChEMBL_751986 (CHEMBL1785928)
IC50>10000±n/a nM
Citation Chen, ZWang, XZhu, WCao, XTong, LLi, HXie, HXu, YTan, SKuang, DDing, JQian, X Acenaphtho[1,2-b]pyrrole-based selective fibroblast growth factor receptors 1 (FGFR1) inhibitors: design, synthesis, and biological activity. J Med Chem54:3732-45 (2011) 
 
Fibroblast growth factor receptor 1
Name:Fibroblast growth factor receptor 1
Type:Receptor
Mol. Mass.:91861.70
Organism:Homo sapiens (Human)
Description:P11362
Residue:822
BDBM50345451
NameBDBM50345451
Synonyms:3-(2-Methyltetrahydrofuran-3-ylthio)-8-oxo-8H-acenaphtho[1,2-b]pyrrole-9-carbonitrile | CHEMBL1784722
TypeSmall organic molecule
Emp. Form.C20H14N2O2S
Mol. Mass.346.402
SMILESCC1OCCC1Sc1ccc2c3c(C#N)c(=O)nc3c3cccc1c23