Reaction Details
TargetFibroblast growth factor receptor 1
LigandBDBM50345460
Substrate/Competitorn/a
Meas. Tech.ChEMBL_751986 (CHEMBL1785928)
IC50>10000±n/a nM
Citation Chen, ZWang, XZhu, WCao, XTong, LLi, HXie, HXu, YTan, SKuang, DDing, JQian, X Acenaphtho[1,2-b]pyrrole-based selective fibroblast growth factor receptors 1 (FGFR1) inhibitors: design, synthesis, and biological activity. J Med Chem54:3732-45 (2011) 
 
Fibroblast growth factor receptor 1
Name:Fibroblast growth factor receptor 1
Type:Receptor
Mol. Mass.:91861.70
Organism:Homo sapiens (Human)
Description:P11362
Residue:822
BDBM50345460
NameBDBM50345460
Synonyms:CHEMBL1784732 | Ethyl 3-(1-(5-Methyl-1,3-oxathiolan-5-yl)ethylthio)-8-oxo-8H-acenaphtho[1,2-b]pyrrole-9-carboxylate
TypeSmall organic molecule
Emp. Form.C23H21NO4S2
Mol. Mass.439.547
SMILESCCOC(=O)c1c2c3ccc(SC(C)C4(C)CSCO4)c4cccc(c2nc1=O)c34