Reaction Details
TargetP2Y purinoceptor 4
LigandBDBM50345499
Substrate/Competitorn/a
Meas. Tech.ChEMBL_751027 (CHEMBL1786812)
EC50 220±n/a nM
Citation Maruoka, HJayasekara, MPBarrett, MOFranklin, DAde Castro, SKim, NCostanzi, SHarden, TKJacobson, KA Pyrimidine nucleotides with 4-alkyloxyimino and terminal tetraphosphated-ester modifications as selective agonists of the P2Y(4) receptor. J Med Chem54:4018-33 (2011) 
 
P2Y purinoceptor 4
Name:P2Y purinoceptor 4
Type:PROTEIN
Mol. Mass.:40977.17
Organism:Homo sapiens (Human)
Description:ChEMBL_751027
Residue:365
BDBM50345499
NameBDBM50345499
Synonyms:CHEMBL1784293 | P1-(Uridine-5'-)P4-(4'-deoxy-4'-fluoroglucose-1'-)tetraphosphate
TypeSmall organic molecule
Emp. Form.C15H25FN2O22P4
Mol. Mass.728.2527
SMILESOC[C@H]1O[C@H](OP(O)(=O)OP(O)(=O)OP(O)(=O)OP(O)(=O)OC[C@H]2O[C@H]([C@H](O)[C@@H]2O)n2ccc(=O)[nH]c2=O)[C@H](O)[C@@H](O)[C@@H]1F