Reaction Details
TargetMatrix metalloproteinase-9
LigandBDBM50345511
Substrate/Competitorn/a
Meas. Tech.ChEMBL_751108 (CHEMBL1787045)
IC50>10000±n/a nM
Citation De Savi, CPape, ASawyer, YMilne, DDavies, CCumming, JGTing, ALamont, SSmith, PDTart, JPage, KMoore, P Orally active achiral N-hydroxyformamide inhibitors of ADAM-TS4 (aggrecanase-1) and ADAM-TS5 (aggrecanase-2) for the treatment of osteoarthritis. Bioorg Med Chem Lett21:3301-6 (2011) 
 
Matrix metalloproteinase-9
Name:Matrix metalloproteinase-9
Type:Enzyme
Mol. Mass.:78452.28
Organism:Homo sapiens (Human)
Description:P14780
Residue:707
BDBM50345511
NameBDBM50345511
Synonyms:CHEMBL1784366 US10322143, Compound 13j
TypeSmall organic molecule
Emp. Form.C19H31N3O5S2
Mol. Mass.445.597
SMILESCc1nsc(C)c1CCC1CCN(CC1)S(=O)(=O)CC1(CCOCC1)N(O)C=O