Reaction Details
TargetMatrix metalloproteinase-9
LigandBDBM50345513
Substrate/Competitorn/a
Meas. Tech.ChEMBL_751108 (CHEMBL1787045)
IC50>100000±n/a nM
Citation De Savi, CPape, ASawyer, YMilne, DDavies, CCumming, JGTing, ALamont, SSmith, PDTart, JPage, KMoore, P Orally active achiral N-hydroxyformamide inhibitors of ADAM-TS4 (aggrecanase-1) and ADAM-TS5 (aggrecanase-2) for the treatment of osteoarthritis. Bioorg Med Chem Lett21:3301-6 (2011) 
 
Matrix metalloproteinase-9
Name:Matrix metalloproteinase-9
Type:Enzyme
Mol. Mass.:78452.28
Organism:Homo sapiens (Human)
Description:P14780
Residue:707
BDBM50345513
NameBDBM50345513
Synonyms:CHEMBL1784338 US10322143, Compound 13l
TypeSmall organic molecule
Emp. Form.C21H33N3O5S
Mol. Mass.439.569
SMILESCc1cc(CCC2CCN(CC2)S(=O)(=O)CC2(CCOCC2)N(O)C=O)c(C)cn1