Reaction Details
TargetMatrix metalloproteinase-9
LigandBDBM50345516
Substrate/Competitorn/a
Meas. Tech.ChEMBL_751108 (CHEMBL1787045)
IC50>10000±n/a nM
Citation De Savi, CPape, ASawyer, YMilne, DDavies, CCumming, JGTing, ALamont, SSmith, PDTart, JPage, KMoore, P Orally active achiral N-hydroxyformamide inhibitors of ADAM-TS4 (aggrecanase-1) and ADAM-TS5 (aggrecanase-2) for the treatment of osteoarthritis. Bioorg Med Chem Lett21:3301-6 (2011) 
 
Matrix metalloproteinase-9
Name:Matrix metalloproteinase-9
Type:Enzyme
Mol. Mass.:78452.28
Organism:Homo sapiens (Human)
Description:P14780
Residue:707
BDBM50345516
NameBDBM50345516
Synonyms:CHEMBL1784341 US10322143, Compound 14a
TypeSmall organic molecule
Emp. Form.C23H37N5O6S
Mol. Mass.511.635
SMILESCc1noc(C)c1CCC1CCN(CC1)S(=O)(=O)CC1(CCN(CC1)C(=O)N1CCC1)N(O)C=O