Reaction Details
TargetA disintegrin and metalloproteinase with thrombospondin motifs 4
LigandBDBM50345514
Substrate/Competitorn/a
Meas. Tech.ChEMBL_751100 (CHEMBL1787037)
IC50 4.5±n/a nM
Citation De Savi, CPape, ASawyer, YMilne, DDavies, CCumming, JGTing, ALamont, SSmith, PDTart, JPage, KMoore, P Orally active achiral N-hydroxyformamide inhibitors of ADAM-TS4 (aggrecanase-1) and ADAM-TS5 (aggrecanase-2) for the treatment of osteoarthritis. Bioorg Med Chem Lett21:3301-6 (2011) 
 
A disintegrin and metalloproteinase with thrombospondin motifs 4
Name:A disintegrin and metalloproteinase with thrombospondin motifs 4
Type:Enzyme
Mol. Mass.:90214.54
Organism:Homo sapiens (Human)
Description:O75173
Residue:837
BDBM50345514
NameBDBM50345514
Synonyms:CHEMBL1784339 US10322143, Compound 13m
TypeSmall organic molecule
Emp. Form.C21H31FN2O5S
Mol. Mass.442.545
SMILESCc1cc(F)ccc1CCC1CCN(CC1)S(=O)(=O)CC1(CCOCC1)N(O)C=O