Reaction Details
TargetA disintegrin and metalloproteinase with thrombospondin motifs 4
LigandBDBM50345536
Substrate/Competitorn/a
Meas. Tech.ChEMBL_751100 (CHEMBL1787037)
IC50 8.7±n/a nM
Citation De Savi, CPape, ASawyer, YMilne, DDavies, CCumming, JGTing, ALamont, SSmith, PDTart, JPage, KMoore, P Orally active achiral N-hydroxyformamide inhibitors of ADAM-TS4 (aggrecanase-1) and ADAM-TS5 (aggrecanase-2) for the treatment of osteoarthritis. Bioorg Med Chem Lett21:3301-6 (2011) 
 
A disintegrin and metalloproteinase with thrombospondin motifs 4
Name:A disintegrin and metalloproteinase with thrombospondin motifs 4
Type:Enzyme
Mol. Mass.:90214.54
Organism:Homo sapiens (Human)
Description:O75173
Residue:837
BDBM50345536
NameBDBM50345536
Synonyms:CHEMBL1784370 US10322143, Compound 15d
TypeSmall organic molecule
Emp. Form.C26H35F4N3O5S
Mol. Mass.577.632
SMILESON(C=O)C1(CS(=O)(=O)N2CCC(CCc3ccc(F)cc3C(F)(F)F)CC2)CCN(CC1)C(=O)C1CCC1