Reaction Details
TargetCollagenase 3
LigandBDBM50345513
Substrate/Competitorn/a
Meas. Tech.ChEMBL_751102 (CHEMBL1787039)
IC50 46000±n/a nM
Citation De Savi, CPape, ASawyer, YMilne, DDavies, CCumming, JGTing, ALamont, SSmith, PDTart, JPage, KMoore, P Orally active achiral N-hydroxyformamide inhibitors of ADAM-TS4 (aggrecanase-1) and ADAM-TS5 (aggrecanase-2) for the treatment of osteoarthritis. Bioorg Med Chem Lett21:3301-6 (2011) 
 
Collagenase 3
Name:Collagenase 3
Type:Enzyme
Mol. Mass.:53808.06
Organism:Homo sapiens (Human)
Description:P45452
Residue:471
BDBM50345513
NameBDBM50345513
Synonyms:CHEMBL1784338 US10322143, Compound 13l
TypeSmall organic molecule
Emp. Form.C21H33N3O5S
Mol. Mass.439.569
SMILESCc1cc(CCC2CCN(CC2)S(=O)(=O)CC2(CCOCC2)N(O)C=O)c(C)cn1