Reaction Details
Target72 kDa type IV collagenase
LigandBDBM50345511
Substrate/Competitorn/a
Meas. Tech.ChEMBL_751107 (CHEMBL1787044)
IC50>10000±n/a nM
Citation De Savi, CPape, ASawyer, YMilne, DDavies, CCumming, JGTing, ALamont, SSmith, PDTart, JPage, KMoore, P Orally active achiral N-hydroxyformamide inhibitors of ADAM-TS4 (aggrecanase-1) and ADAM-TS5 (aggrecanase-2) for the treatment of osteoarthritis. Bioorg Med Chem Lett21:3301-6 (2011) 
 
72 kDa type IV collagenase
Name:72 kDa type IV collagenase
Type:Enzyme
Mol. Mass.:73870.36
Organism:Homo sapiens (Human)
Description: P08253
Residue:660
BDBM50345511
NameBDBM50345511
Synonyms:CHEMBL1784366 US10322143, Compound 13j
TypeSmall organic molecule
Emp. Form.C19H31N3O5S2
Mol. Mass.445.597
SMILESCc1nsc(C)c1CCC1CCN(CC1)S(=O)(=O)CC1(CCOCC1)N(O)C=O