Reaction Details
TargetMetabotropic glutamate receptor 5
LigandBDBM50345552
Substrate/Competitorn/a
Meas. Tech.ChEMBL_751566 (CHEMBL1787492)
IC50 1.61±n/a nM
Citation Alagille, DDaCosta, HChen, YHemstapat, KRodriguez, ABaldwin, RMConn, JPTamagnan, GD Potent mGluR5 antagonists: pyridyl and thiazolyl-ethynyl-3,5-disubstituted-phenyl series. Bioorg Med Chem Lett21:3243-7 (2011) 
 
Metabotropic glutamate receptor 5
Name:Metabotropic glutamate receptor 5
Type:Enzyme
Mol. Mass.:131900.14
Organism:Rattus norvegicus (Rat)
Description:P31424
Residue:1203
BDBM50345552
NameBDBM50345552
Synonyms:3-(2-(2-methylthiazol-4-yl)ethynyl)-5-chlorobenzonitrile | CHEMBL1784598
TypeSmall organic molecule
Emp. Form.C13H7ClN2S
Mol. Mass.258.726
SMILESCc1nc(cs1)C#Cc1cc(Cl)cc(c1)C#N