Reaction Details
TargetMetabotropic glutamate receptor 5
LigandBDBM50122758
Substrate/Competitorn/a
Meas. Tech.ChEMBL_751566 (CHEMBL1787492)
IC50 5±n/a nM
Citation Alagille, DDaCosta, HChen, YHemstapat, KRodriguez, ABaldwin, RMConn, JPTamagnan, GD Potent mGluR5 antagonists: pyridyl and thiazolyl-ethynyl-3,5-disubstituted-phenyl series. Bioorg Med Chem Lett21:3243-7 (2011) 
 
Metabotropic glutamate receptor 5
Name:Metabotropic glutamate receptor 5
Type:Enzyme
Mol. Mass.:131900.14
Organism:Rattus norvegicus (Rat)
Description:P31424
Residue:1203
BDBM50122758
NameBDBM50122758
Synonyms:2-methyl-4-(pyridin-3-ylethynyl)thiazole 3-(2-Methyl-thiazol-4-ylethynyl)-pyridine 3-[(2-methyl-4-thiazolyl)ethynyl]pyridine MTEP
TypeSmall organic molecule
Emp. Form.C11H8N2S
Mol. Mass.200.26
SMILESCc1nc(cs1)C#Cc1cccnc1