Reaction Details
TargetAngiopoietin-1 receptor
LigandBDBM50345579
Substrate/Competitorn/a
Meas. Tech.ChEMBL_751376 (CHEMBL1785337)
IC50 2.2±n/a nM
Citation Thomas, MHuang, WSWen, DZhu, XWang, YMetcalf, CALiu, SChen, IRomero, JZou, DSundaramoorthi, RLi, FQi, JCai, LZhou, TCommodore, LXu, QKeats, JWang, FWardwell, SNing, YSnodgrass, JTBroudy, MIRussian, KIuliucci, JRivera, VMSawyer, TKDalgarno, DCClackson, TShakespeare, WC Discovery of 5-(arenethynyl) hetero-monocyclic derivatives as potent inhibitors of BCR-ABL including the T315I gatekeeper mutant. Bioorg Med Chem Lett21:3743-8 (2011) 
 
Angiopoietin-1 receptor
Name:Angiopoietin-1 receptor
Type:Enzyme
Mol. Mass.:125835.70
Organism:Homo sapiens (Human)
Description:Q02763
Residue:1124
BDBM50345579
NameBDBM50345579
Synonyms:5-((5-(4-((4-(2-hydroxyethyl)piperazin-1-yl)methyl)-3-(trifluoromethyl)phenylcarbamoyl)-2-methylphenyl)ethynyl)-N,1-dimethyl-1H-imidazole-2-carboxamide | CHEMBL1784637
TypeSmall organic molecule
Emp. Form.C30H33F3N6O3
Mol. Mass.582.6166
SMILESCNC(=O)c1ncc(C#Cc2cc(ccc2C)C(=O)Nc2ccc(CN3CCN(CCO)CC3)c(c2)C(F)(F)F)n1C