Reaction Details
TargetTyrosine-protein kinase ABL1
LigandBDBM50345585
Substrate/Competitorn/a
Meas. Tech.ChEMBL_751378 (CHEMBL1785339)
IC50 55±n/a nM
Citation Thomas, MHuang, WSWen, DZhu, XWang, YMetcalf, CALiu, SChen, IRomero, JZou, DSundaramoorthi, RLi, FQi, JCai, LZhou, TCommodore, LXu, QKeats, JWang, FWardwell, SNing, YSnodgrass, JTBroudy, MIRussian, KIuliucci, JRivera, VMSawyer, TKDalgarno, DCClackson, TShakespeare, WC Discovery of 5-(arenethynyl) hetero-monocyclic derivatives as potent inhibitors of BCR-ABL including the T315I gatekeeper mutant. Bioorg Med Chem Lett21:3743-8 (2011) 
 
Tyrosine-protein kinase ABL1
Name:Tyrosine-protein kinase ABL1
Type:Enzyme
Mol. Mass.:122897.30
Organism:Homo sapiens (Human)
Description:P00519
Residue:1130
BDBM50345585
NameBDBM50345585
Synonyms:CHEMBL1784636 | N-(2-hydroxyethyl)-1-methyl-5-((2-methyl-5-(4-((4-methylpiperazin-1-yl)methyl)-3-(trifluoromethyl)phenylcarbamoyl)phenyl)ethynyl)-1H-imidazole-2-carboxamide
TypeSmall organic molecule
Emp. Form.C30H33F3N6O3
Mol. Mass.582.6166
SMILESCN1CCN(Cc2ccc(NC(=O)c3ccc(C)c(c3)C#Cc3cnc(C(=O)NCCO)n3C)cc2C(F)(F)F)CC1