Reaction Details
Target5-hydroxytryptamine receptor 1A
LigandBDBM50345703
Substrate/Competitorn/a
Meas. Tech.ChEMBL_750527 (CHEMBL1786288)
Ki 2.4±n/a nM
Citation Alonso, DVázquez-Villa, HGamo, AMMartínez-Esperón, MFTortosa, MViso, AFernández de la Pradilla, RJunquera, EAicart, EMartín-Fontecha, MBenhamú, BLópez-Rodríguez, MLOrtega-Gutiérrez, S Development of Fluorescent Ligands for the Human 5-HT1A Receptor. ACS Med Chem Lett1:249-253 (2010) 
 
5-hydroxytryptamine receptor 1A
Name:5-hydroxytryptamine receptor 1A
Type:n/a
Mol. Mass.:46122.49
Organism:Homo sapiens (Human)
Description:n/a
Residue:422
BDBM50345703
NameBDBM50345703
Synonyms:8-{4-[4-(1,3-Dioxotetrahydro-1H-pyrrolo[1,2-c]imidazol-2(3H)-yl)butyl]piperazin-1-yl}-N,N-dimethylnaphthalene-2-sulfonamide | CHEMBL1784939
TypeSmall organic molecule
Emp. Form.C26H35N5O4S
Mol. Mass.513.652
SMILESCN(C)S(=O)(=O)c1ccc2cccc(N3CCN(CCCCn4c(O)c5CCCn5c4=O)CC3)c2c1