Reaction Details
TargetProtein-tyrosine kinase 2-beta
LigandBDBM50246060
Substrate/Competitorn/a
Meas. Tech.ChEMBL_749784 (CHEMBL1787944)
IC50 31±n/a nM
Citation Walker, DPZawistoski, MPMcGlynn, MALi, JCKung, DWBonnette, PCBaumann, ABuckbinder, LHouser, JABoer, JMistry, AHan, SXing, LGuzman-Perez, A Sulfoximine-substituted trifluoromethylpyrimidine analogs as inhibitors of proline-rich tyrosine kinase 2 (PYK2) show reduced hERG activity. Bioorg Med Chem Lett19:3253-8 (2009) 
 
Protein-tyrosine kinase 2-beta
Name:Protein-tyrosine kinase 2-beta
Type:Protein
Mol. Mass.:115868.80
Organism:Homo sapiens (Human)
Description:Q14289
Residue:1009
BDBM50246060
NameBDBM50246060
Synonyms:CHEMBL472212 D3RKN_6 N-methyl-N-{2-[({2-[(2-oxo-2,3-dihydro-1H-indol-5-yl)amino]-5-(trifluoromethyl)pyrimidin-4-yl}amino)methyl]phenyl}methanesulfonamide | PF-431396
TypeSmall organic molecule
Emp. Form.C22H21F3N6O3S
Mol. Mass.506.501
SMILESCN(c1ccccc1CNc1nc(Nc2ccc3NC(=O)Cc3c2)ncc1C(F)(F)F)S(C)(=O)=O