Reaction Details
TargetProtein-tyrosine kinase 2-beta
LigandBDBM50246285
Substrate/Competitorn/a
Meas. Tech.ChEMBL_749784 (CHEMBL1787944)
IC50 95±n/a nM
Citation Walker, DPZawistoski, MPMcGlynn, MALi, JCKung, DWBonnette, PCBaumann, ABuckbinder, LHouser, JABoer, JMistry, AHan, SXing, LGuzman-Perez, A Sulfoximine-substituted trifluoromethylpyrimidine analogs as inhibitors of proline-rich tyrosine kinase 2 (PYK2) show reduced hERG activity. Bioorg Med Chem Lett19:3253-8 (2009) 
 
Protein-tyrosine kinase 2-beta
Name:Protein-tyrosine kinase 2-beta
Type:Protein
Mol. Mass.:115868.80
Organism:Homo sapiens (Human)
Description:Q14289
Residue:1009
BDBM50246285
NameBDBM50246285
Synonyms:CHEMBL519418 | N4-((1R,2R)-2-(dimethylamino)cyclopentyl)-N2-(4-(methylsulfonyl)phenyl)-5-(trifluoromethyl)pyrimidine-2,4-diamine
TypeSmall organic molecule
Emp. Form.C19H24F3N5O2S
Mol. Mass.443.486
SMILESCN(C)[C@@H]1CCC[C@H]1Nc1nc(Nc2ccc(cc2)S(C)(=O)=O)ncc1C(F)(F)F